-------------------------------------------------------------------------------
Test set: com.ranorex.selenium.TestPageTest
-------------------------------------------------------------------------------
Tests run: 2, Failures: 1, Errors: 0, Skipped: 0, Time elapsed: 16.318 sec <<< FAILURE!
testValidateForm(com.ranorex.selenium.TestPageTest)  Time elapsed: 7.105 sec  <<< FAILURE!
java.lang.AssertionError: Text does not match! [expected: Array
(
    [value1] => Hi from
    [value2] => Ranorex
    [checkbox2] => true
    [color2] => bluex
)] [actual: Array
(
    [value1] => Hi from
    [value2] => Ranorex
    [checkbox2] => true
    [color2] => blue
)]
	at org.junit.Assert.fail(Assert.java:93)
	at org.junit.Assert.assertTrue(Assert.java:43)
	at io.ddavison.conductor.Locomotive.validateText(Locomotive.java:668)
	at com.ranorex.selenium.TestPageTest.testValidateForm(TestPageTest.java:48)
	at sun.reflect.NativeMethodAccessorImpl.invoke0(Native Method)
	at sun.reflect.NativeMethodAccessorImpl.invoke(NativeMethodAccessorImpl.java:62)
	at sun.reflect.DelegatingMethodAccessorImpl.invoke(DelegatingMethodAccessorImpl.java:43)
	at java.lang.reflect.Method.invoke(Method.java:498)
	at org.junit.runners.model.FrameworkMethod$1.runReflectiveCall(FrameworkMethod.java:45)
	at org.junit.internal.runners.model.ReflectiveCallable.run(ReflectiveCallable.java:15)
	at org.junit.runners.model.FrameworkMethod.invokeExplosively(FrameworkMethod.java:42)
	at org.junit.internal.runners.statements.InvokeMethod.evaluate(InvokeMethod.java:20)
	at org.junit.internal.runners.statements.FailOnTimeout$StatementThread.run(FailOnTimeout.java:62)

